The Muninn Graves Ontology
type: Ontology
title: Muninn坟墓本体 @zh-cn
prior version: graves-20120118.owl
description: The Muninn Graves Ontology is meant to deal with the remains of human beings.
description: Muninn坟墓本体的意思是用于处理人类的遗体。 @zh-cn
version info: 1.0
term status: Stable
date: 20121031

Dead people place
type: Class
label: Endroit aves des gens mort @fr
label: Menschen starben @de
label: 死者埋葬地 @zh-cn
comment: A physical and administrative place with dead people in it. Of the non-zombie kind.
comment: 一个死者埋葬的物理的行政区域。非僵尸类。 @zh-cn

Monument
type: Class
label: 遗迹 @zh-cn
comment: A physical feature commemorating something or someone.
comment: 一个纪念某事或某人的实物特征。 @zh-cn
equivalent class: Monument

Monument
wikipedia version: 500351354

Container of human remains
type: Class
label: Container von menschlichen Überresten @de
label: Un contenant pour des restes humains. @fr
label: 尸体容器 @zh-cn
comment: A generic class to unify all containers of human remains.
comment: Eine generische Klasse für alle Container von menschlichen Überresten zu vereinheitlichen. @de
comment: Une classe générique pour tout les restes humains. @fr
comment: 统一了所有死者容器的一般类。 @zh-cn

Human remains
type: Class
label: Restes Humains @fr
label: Die Überreste eines Menschen. @de
label: 人类尸体 @zh-cn

Crypt
type: Class
label: Crypte @fr
label: Krypta @de
label: 墓穴 @zh-cn
sub class of: Dead people place
sub class of: Memorial
equivalent class: Crypt

Crypt
wikipedia version: 509719217

Shipwreck
type: Class
label: Épave @fr
label: 海难 @zh-cn
sub class of: Dead people place
sub class of: Ship
has state: Wrecked
equivalent class: Shipwreck
sub class of: Restriction
  on property: Object is in a state
  has value: Wrecked

Shipwreck
wikipedia version: 513841901

At Depth
type: ObjectProperty
name: At Depth
label: A une profondeur @fr
label: 深度 @zh-cn
comment: Record the approximate depth that the wreck lies at.
comment: 记录了遇难船只残骸所处的大致深度。 @zh-cn
domain: Shipwreck

Statue
type: Class
label: 雕像 @zh-cn
sub class of: Monument
equivalent class: Statue

Statue
wikipedia version: 509775553

Burial Mound
type: Class
label: 坟冢 @zh-cn
sub class of: Memorial
sub class of: Dead people place

Tumulus
type: Class
comment: Tumulus is actually the Latin word, but unclear what the appropriate English label is here.
comment: Tumulus实际上是个拉丁文，不太清楚这里应该用哪个英文名称。 @zh-cn
label: Hügelgrab @de
label: 陵墓 @zh-cn
sub class of: Memorial
sub class of: Dead people place
equivalent class: Tumulus

Tumulus
wikipedia version: 515641451

Shrine
type: Class
label: Sanctuaire @fr
label: Schrein @de
label: 祠堂 @zh-cn
sub class of: Memorial
equivalent class: Shrine

Shrine
wikipedia version: 515137037

Memorial
type: Class
label: Mémorial @fr
label: Gedenkstätte @de
label: 纪念碑 @zh-cn
comment: A physical feature commemorating a person or group of people who have died.
comment: 用于纪念某个或某类死者的实物特征。 @zh-cn
sub class of: Monument
equivalent class: Memorial

Memorial
wikipedia version: 506256644

Object is in a state
type: ObjectProperty
name: has State
label: L'état de l'object @fr
label: Zustand des Objekts @de
label: 状况 @zh-cn
comment: The state of the object in terms of in construction, ruined, destroyed.
comment: 物体在建造、毁坏、破坏方面的状况。 @zh-cn
domain: Monument
domain: Dead people place
domain: Container of human remains
range: Object States

Object states
type: ConceptScheme
name: Object States
label: Les états possibles des objets @fr
label: Die möglichen Zustände der Gegenstände @de
label: 物体状态体系 @zh-cn

Object States
type: Class
label: état possible des objects @fr
label: 物体状态 @zh-cn
comment: A set of states that an object can be in.
comment: 物体可能处于的一组状态。 @zh-cn

unserviceable
type: ObjectState
type: Concept
name: unserviceable
label: 无法使用 @zh-cn
comment: The object is incapable of functioning but may be repairable.
comment: 物体在功能方面不可用，但是可能被修复。 @zh-cn
in scheme: ObjectStatesScheme
top concept of: ObjectStatesScheme

Unbuilt
type: ObjectState
type: Concept
name: Unbuilt
label: 未建造 @zh-cn
comment: The object is planned for construction but work has not begun (and / or may never be built).
comment: 计划建造某物，但是还没开展工作（或者可能能不会再建造）。 @zh-cn
in scheme: ObjectStatesScheme
top concept of: ObjectStatesScheme

Rebuilt
type: ObjectState
name: Rebuilt
label: 重建 @zh-cn
comment: The object has been made servicable after damage through repairs.
comment: 毁坏之后，通过修复，物体达到了可用的状态。 @zh-cn
in scheme: ObjectStatesScheme
top concept of: ObjectStatesScheme
type: Concept

Abandoned
type: ObjectState
name: Abandoned
label: 废弃 @zh-cn
comment: The object still exists but is not in use.
comment: 物体仍然存在，但是不再使用。 @zh-cn
in scheme: ObjectStatesScheme
top concept of: ObjectStatesScheme
type: Concept

Serviceable
type: ObjectState
name: Serviceable
label: 可用 @zh-cn
comment: The object is capable of performing its function (but may not be activated or in use).
comment: 物体能履行它的功能（但是可能不在激活中或没有使用中）。 @zh-cn
in scheme: ObjectStatesScheme
top concept of: ObjectStatesScheme
type: Concept

Eliminated
type: ObjectState
name: Eliminated
label: 淘汰 @zh-cn
comment: The object was completely and permanently destroyed or disassmbled. No remains or traces of the object exists.
comment: 物体完全、永久的毁坏或分拆了，没有存在过的遗留或痕迹。 @zh-cn
in scheme: ObjectStatesScheme
top concept of: ObjectStatesScheme
type: Concept

Demolished
type: ObjectState
name: Demolished
label: 拆毁 @zh-cn
comment: The object was destroyed or disassmbled and remains or traces of the object may exists.
comment: 物体毁坏或分拆了，可能仍有遗留或痕迹。 @zh-cn
in scheme: ObjectStatesScheme
top concept of: ObjectStatesScheme
type: Concept

Wrecked
type: ObjectState
name: Wrecked
label: 失事被毁 @zh-cn
label: Démoli @fr
label: zerstört @de
comment: The object is wrecked, crashed or in a state of disrepair because something collided with it or the ship sank.
comment: 由于相撞或船只沉没，某物失事、被撞毁或处于失修状态。 @zh-cn
in scheme: ObjectStatesScheme
type: Concept

Burned
type: ObjectState
name: Burned
label: 烧毁 @zh-cn
comment: The object was damaged by fire and it either permanently or temporarely unservicable.
comment: 物体被火烧毁，永久或临时处于不可用状态。 @zh-cn
in scheme: ObjectStatesScheme
type: Concept

Ruins
type: ObjectState
name: Ruins
label: 毁坏 @zh-cn
comment: The object has been unservicable for some time and cannot be repaired, but some traces of the objects can still be observed.
comment: 物体已经不可用了，并且不能被修复，但是仍能观察到它的一些痕迹。 @zh-cn
in scheme: ObjectStatesScheme
type: Concept

has Map
type: ObjectProperty
name: hasMap
label: A une carte @fr
label: eine Karte @de
label: 地图 @zh-cn
comment: Pointer to a instances or class that describes the map or grid reference system in use. Primarily meant for use with archeological digs and cemeteries, it is potentially useful for very large monuments.
comment: 指向一个描述了使用中的地图或网格参考系统的实例或类。主要指用于考古或坟墓挖掘，对大型遗迹会很有用。 @zh-cn
domain: Monument
domain: Dead people place

Has an additional part
type: ObjectProperty
name: Has a part
label: A une partie additionnelle @fr
label: Ein Teil Zusätzliche @de
label: 部分 @zh-cn
comment: When dealing with complex monuments, use this to attach a main monument instance to a sub-monument.
comment: 在处理复杂遗迹的时候，用这个属性将一个主遗迹与附属遗迹关联起来。 @zh-cn
domain: Monument
range: Monument

is Part of a monument
type: ObjectProperty
name: Is a part of
label: Fait partie d'un monument additionnel @fr
label: Teil eines Denkmals zusätzliche @de
label: 属于 @zh-cn
comment: When dealing with complex monuments, use this to attach a sub-monument to the main instance.
comment: 在处理复杂遗迹的时候，用这个属性将一个附属遗迹与主遗迹关联起来。 @zh-cn
domain: Monument
range: Monument
inverse of: Has an additional part

Has a north-facing surface
type: ObjectProperty
name: Has a North Face
label: A une surface qui fait face au nord @fr
label: Es hat eine Oberfläche, die die Nordwände @de
label: 北面遗迹 @zh-cn
comment: When dealing with monuments with multiple surfaces bearing inscriptions, use this property to link a Monument instance to another Monument instance describing that perticular surface that faces north.
comment: 在处理多面带有铭文的遗迹的时候，用这个属性将一个Monument实例与另一个描述了朝向北面的Monument实例关联起来。 @zh-cn
domain: Monument
range: Monument

Is the north-facing surface of a Monument
type: ObjectProperty
name: Is the North Face of
label: Est la surface nord du monument @fr
label: Ist das Gebiet nördlich des Denkmals @de
label: 主遗迹 @zh-cn
comment: When dealing with monuments with multiple surfaces bearing inscriptions, use this property to link the north-facing surface to the main Monument instance.
comment: 在处理多面带有铭文的遗迹的时候，用这个属性将一个北朝向的Monument实例与主要Monument实例关联起来。 @zh-cn
domain: Monument
range: Monument
inverse of: Has a north-facing surface
sub property of: is Part of a monument

Has a south-facing surface
type: ObjectProperty
name: Has a South Face
label: A une surface qui fait face au sud @fr
label: Es hat eine Oberfläche, die die nach Süden ausgerichtet @de
label: 南面遗迹 @zh-cn
comment: When dealing with monuments with multiple surfaces bearing inscriptions, use this property to link a Monument instance to another Monument instance describing the perticular surface that faces south.
comment: 在处理多面带有铭文的遗迹的时候，用这个属性将一个Monument实例与另一个描述了朝向南面的Monument实例关联起来。 @zh-cn
domain: Monument
range: Monument

Is the south-facing surface of a Monument
type: ObjectProperty
name: Is the South Face of
label: Est la surface sud du monument @fr
label: Ist das Gebiet südlich des Denkmals @de
label: 主遗迹 @zh-cn
comment: When dealing with monuments with multiple surfaces bearing inscriptions, use this property to link the south-facing surface to the main Monument instance.
comment: 在处理多面带有铭文的遗迹的时候，用这个属性将一个南朝向的Monument实例与主要Monument实例关联起来。 @zh-cn
domain: Monument
range: Monument
inverse of: Has a south-facing surface
sub property of: is Part of a monument

Has a west-facing surface
type: ObjectProperty
name: Has a West Face
label: A une surface qui fait face à l'ouest @fr
label: Auf eine Oberfläche nach Westen @de
label: 西面遗迹 @zh-cn
comment: When dealing with monuments with multiple surfaces bearing inscriptions, use this property to link a Monument instance to another Monument instance describing the perticular surface that faces west.
comment: 在处理多面带有铭文的遗迹的时候，用这个属性将一个Monument实例与另一个描述了朝向西面的Monument实例关联起来。 @zh-cn
domain: Monument
range: Monument

Is the west-facing surface of a Monument
type: ObjectProperty
name: Is the West Face of
label: Est la surface west du monument @fr
label: Ist das Gebiet westlich des Denkmals @de
label: 主遗迹 @zh-cn
comment: When dealing with monuments with multiple surfaces bearing inscriptions, use this property to link the west-facing surface to the main Monument instance.
comment: 在处理多面带有铭文的遗迹的时候，用这个属性将一个西朝向的Monument实例与主要Monument实例关联起来。 @zh-cn
domain: Monument
range: Monument
inverse of: Has a west-facing surface
sub property of: is Part of a monument

Has a east-facing surface
type: ObjectProperty
name: Has a East Face
label: A une surface qui fait face à l'est @fr
label: Es hat eine Fläche, die östlich Gesichter @de
label: 东面遗迹 @zh-cn
comment: When dealing with monuments with multiple surfaces bearing inscriptions, use this property to link a Monument instance to another Monument instance describing the perticular surface that faces east.
comment: 在处理多面带有铭文的遗迹的时候，用这个属性将一个Monument实例与另一个描述了朝向东面的Monument实例关联起来。 @zh-cn
domain: Monument
range: Monument

Is the east-facing surface of a Monument
type: ObjectProperty
name: Is the East Face of
label: Est la surface est du monument @fr
label: Ist die Oberfläche des Denkmals @de
label: 主遗迹 @zh-cn
comment: When dealing with monuments with multiple surfaces bearing inscriptions, use this property to link the east-facing surface to the main Monument instance.
comment: 在处理多面带有铭文的遗迹的时候，用这个属性将一个东朝向的Monument实例与主要Monument实例关联起来。 @zh-cn
domain: Monument
range: Monument
inverse of: Has a east-facing surface
sub property of: is Part of a monument

Has a front-facing surface
type: ObjectProperty
name: Has a Front Face
label: A une surface qui est le devant du monument @fr
label: Es hat eine Oberfläche, die die vor dem Denkmal ist @de
label: 正面 @zh-cn
comment: Use this property to link a Monument instance to another Monument instance that describes the front of the monument. The front of the monument is defined as the surface that the monument designer intended the visitor to see as a first surface.
comment: 用这个属性将一个Monument实例与另一个描述了朝向正面的Monument实例关联起来。遗迹的正面定义为设计者想要访问者最初看见的那一面。 @zh-cn
domain: Monument
range: Monument

Is the front-facing surface of
type: ObjectProperty
name: Is the Front Face of
label: Est la surface qui est le devant du monument @fr
label: Ist die Oberfläche, die vor dem Denkmal ist @de
label: 主遗迹 @zh-cn
comment: Use this property to link the monument instance describing the front surface of the monument to the main monument instance.
comment: 用这个属性将一个描述了朝向正面的Monument实例与主要Monument实例关联起来。 @zh-cn
domain: Monument
range: Monument
inverse of: Has a front-facing surface
sub property of: is Part of a monument

Has a rear-facing surface
type: ObjectProperty
name: Has a Rear Face
label: A une surface qui est le derrière du monument @fr
label: Auf einer Fläche, die sich hinter dem Denkmal @de
label: 背面 @zh-cn
comment: Use this property to link a Monument instance to another Monument instance that describes the rear-facing surface of the monument. The front of the monument is defined as the surface that the monument designer intended the visitor to see as a first surface.
comment: 用这个属性将一个Monument实例与另一个描述了朝向背面的Monument实例关联起来。遗迹的正面定义为设计者想要访问者最初看见的那一面。 @zh-cn
domain: Monument
range: Monument

Is the rear-facing surface of
type: ObjectProperty
name: Is the Rear Face of
label: Est la surface qui est le derrière du monument @fr
label: Ist die Fläche, die hinter dem Denkmal ist @de
label: 主遗迹 @zh-cn
comment: Use this property to link the monument instance describing the rear-facing surface of the monument to the main monument instance.
comment: 用这个属性将一个描述了朝向背面的Monument实例与主要Monument实例关联起来。 @zh-cn
domain: Monument
range: Monument
inverse of: Has a rear-facing surface
sub property of: is Part of a monument

Has a Top Face
type: ObjectProperty
name: Has a Top Face
label: A une surface qui est supérieure au monument @fr
label: Es hat eine Oberfläche, die über dem Denkmal ist @de
label: 顶部 @zh-cn
comment: Use this property to link the main monument to a monument instance that is on top of the main one. Generally done for statues that are mounted to a pedestal with a plaque.
comment: 用这个属性将主要Monument实例与一个描述了顶部的Monument实例关联起来。通常用于安装在含有牌匾基座上的雕像。 @zh-cn
domain: Monument
range: Monument

Is the top-facing surface of
type: ObjectProperty
name: Is the Top Part of
label: Est la surface supérieure du monument @fr
label: Ist der oberen Oberfläche des Bauwerks @de
label: 主遗迹 @zh-cn
comment: Use this property to link the monument instance describing the top-part of the monument to the main monument instance. Usually used for statues.
comment: 用这个属性将一个描述了顶部的Monument实例与主要Monument实例关联起来。通常用于雕像。 @zh-cn
domain: Monument
range: Monument
inverse of: Has a Top Face
sub property of: is Part of a monument

Has a Bottom Face
type: ObjectProperty
name: Has a Bottom Face
label: A une surface qui est inférieur au monument @fr
label: Es hat eine Oberfläche, die unter dem Bauwerk @de
label: 底部 @zh-cn
comment: Use this property to link the main monument to a monument instance that is on the bottom of the main one. Generally used by artists to sign their work.
comment: 用这个属性将主要Monument实例与一个描述了底部的Monument实例关联起来。通常由艺术家用于为他们的作品进行签名。 @zh-cn
domain: Monument
range: Monument

Is the bottom-facing surface of
type: ObjectProperty
name: Is the Top Face of
label: Est la surface inférieur du monument @fr
label: Liegt unter der Oberfläche des Denkmals @de
label: 主遗迹 @zh-cn
comment: Use this property to link the monument instance describing the bottom-part of the monument to the main monument instance. Generally used by artists to sign their work.
comment: 用这个属性将一个描述了底部的Monument实例与主要Monument实例关联起来。通常由艺术家用于为他们的作品进行签名。 @zh-cn
domain: Monument
range: Monument
inverse of: Has a Bottom Face
sub property of: is Part of a monument

Cenotaph
type: Class
label: Cénotaphe @fr
label: Kenotaph @de
label: 衣冠冢 @zh-cn
sub class of: Memorial
disjoint with: Tombstone
equivalent class: Cenotaph

Cenotaph
wikipedia version: 513340641

Sarcophagus
type: Class
label: Sarcophage @fr
label: Sarkophag @de
label: 石棺 @zh-cn
sub class of: Dead people place
sub class of: Memorial
equivalent class: Sarcophagus

Sarcophagus
wikipedia version: 511906061

Commemorative plaque
type: Class
sub class of: Monument
label: Plaque commémorative @fr
label: Gedenktafel @de
label: 匾额 @zh-cn
comment: A plaque commemorating a person, thing or event.
comment: 用于纪念人、物或事件的匾额。 @zh-cn
equivalent class: Commemorative plaque

Commemorative plaque
wikipedia version: 511073020

Tombstone
type: Class
label: Pierre Tombale @fr
label: Grabstein @de
label: 墓碑 @zh-cn
equivalent class: Tombstone
sub class of: Memorial

Tombstone
wikipedia version: 204275896

Headstone
type: Class
label: Pierre Tombale @fr
label: Grabstein @de
label: 墓碑 @zh-cn
comment: Convinience class - redirects to #tombstone.
comment: 方便类 - 重定向到#Tombstone。 @zh-cn

Gravestone
type: Class
label: Pierre Tombale @fr
label: Grabstein @de
label: 墓碑 @zh-cn
comment: Convinience class - redirects to #tombstone.
comment: 方便类 - 重定向到#Tombstone。 @zh-cn

Archaeological dig site
type: Class
label: Site de fouilles archéologiques @fr
label: Archäologische Ausgrabungsstätte @de
label: 考古挖掘遗场 @zh-cn
comment: A physical location under the administration of an Archaeological organization where graves are being exhumed.
comment: Un site archéologiques sous le controle d'un groupe de recherche où des fouilles prennent place. @fr
comment: Eine archäologische Ausgrabungsstätte unter der Kontrolle von einer Arbeitsgruppe, wo Ausgrabungen stattfinden. @de
comment: 坟墓正被挖掘出的考古组织管理下的实际位置。 @zh-cn
sub class of: Dead people place
equivalent class: ArchaeologicalSite

Cemetery
type: Class
name: Cemetery
label: Cimetière @fr
label: Friedhof @de
label: 墓地 @zh-cn
comment: A collection of graves in a single administrative unit. Distinct from a mass-grave.
comment: Une collection de tombes dans une unitée administrative (et non pas un charnier). @fr
comment: Eine Sammlung von Gräbern in einer administrativen Einheit (keine Masse). @de
comment: 在一个行政单位内的一组坟墓。不同于乱葬岗。 @zh-cn
equivalent class: Cemetery
equivalent class: LanduseCemetery
disjoint with: Mass Grave
sub class of: Dead people place

Cemetery
wikipedia version: 514561782

Graveyard (Small, Religious or Unofficial)
type: Class
name: Graveyard
label: Cimetière (Petit, Religieu or non-officiel) @fr
label: Kirchhof @de
label: 墓地 @zh-cn
comment: A collection of graves in a single location, smaller in number than a cemetery that is usually attached to a place of worship and non longer used for new burials.
comment: 在一个地点内的一组坟墓。数量上比cemetery小，通常附属于一个礼拜场所，并不再用于新的埋葬。 @zh-cn
equivalent class: Graveyard
disjoint with: Mass Grave
disjoint with: Cemetery
sub class of: Dead people place

Graveyard
wikipedia version: 510068969

Churchyard (Small, Religious or Unofficial)
type: Class
name: Churchyard
label: Cimetière d'église (Petit, Religieu or non-officiel) @fr
label: Kirchhof @de
label: 教堂墓地 @zh-cn
comment: A collection of graves in a single location, smaller in number than a cemetery that is attached to a place of worship and non longer used for new burials. Must have a denomination.
comment: 在一个地点内的一组坟墓。数量上比cemetery小，通常附属于一个礼拜场所，并不再用于新的埋葬。必须有一个denomination属性（教派）。 @zh-cn
disjoint with: Mass Grave
disjoint with: Cemetery
sub class of: Graveyard (Small, Religious or Unofficial)
sub class of: Restriction
  on property: Denomination
  min cardinality: 1

Cemetery (Military)
type: Class
name: Cemetery
label: Cimetière (Militare) @fr
label: Friedhof (Militär) @de
label: 军事公墓 @zh-cn
comment: A collection of graves of soldiers in a single administrative unit. Distinct from a mass-grave. May also contain civilian graves, but the primary purpose of the cemetary must be military.
comment: 在一个行政单位内的一组士兵坟墓。不同于乱葬岗。也可能包括市民的坟墓，但是主要的纪念目的是军用的。 @zh-cn
disjoint with: Mass Grave
sub class of: Cemetery

Site Name
type: DeprecatedProperty
term status: archaic
label: Nom du site @fr
label: Site-Namen @de
label: 名称 @zh-cn
comment: The name of the site / monument.
comment: 遗址/遗迹的名称。 @zh-cn
domain: Dead people place
domain: Monument
range: string

Site Name
type: DatatypeProperty
label: Nom du site @fr
label: Site-Namen @de
label: 名称 @zh-cn
comment: The name of the site / monument.
comment: 遗址/遗迹的名称。 @zh-cn
domain: Dead people place
domain: Monument
equivalent property: Site Name

ID
type: DatatypeProperty
comment: Local ID number for non linked open data processing.
comment: 用于非连接的开放数据处理的本地号码。 @zh-cn
domain: Dead people place
domain: Human remains
domain: Container of human remains
domain: Monument
range: string

Moved from
type: DeprecatedProperty
term status: archaic
label: 迁移自 @zh-cn
comment: Use this to relate a grave or remains to its original instance elsewhere. Use this for disinterments.
domain: Dead people place
domain: Container of human remains
domain: Human remains
domain: Monument
inverse of: Moved to

Moved to
type: DeprecatedProperty
term status: archaic
label: 迁移到 @zh-cn
comment: Use this to relate a grave or remains to its original instance elsewhere. Use this for disinterments.
domain: Dead people place
domain: Container of human remains
domain: Human remains
domain: Monument

Moved from
type: ObjectProperty
label: 迁移自 @zh-cn
comment: Use this to relate a grave or remains to its original instance elsewhere. Use this for disinterments, relocation, storage, etc...
comment: 使用这个属性将一个坟墓或尸体与其它的原始位置关联起来。用于挖掘、搬迁、存储等等。 @zh-cn
domain: Dead people place
domain: Container of human remains
domain: Human remains
domain: Monument
inverse of: Moved to
equivalent property: Moved from

Moved to
type: ObjectProperty
label: 迁移到 @zh-cn
comment: Use this to relate a grave or remains to its next instance elsewhere. Use this for disinterments, relocation, storage, etc...
comment: 使用这个属性将一个坟墓或尸体与它的下一个位置关联起来。用于挖掘、搬迁、存储等等。 @zh-cn
domain: Dead people place
domain: Container of human remains
domain: Human remains
domain: Monument
equivalent property: Moved to

Moved on
type: DeprecatedProperty
term status: archaic
label: Date or interval when the objects were moved.
label: 迁移日期 @zh-cn
domain: Moved from
domain: Moved to
range: TemporalEntity

End Date
type: DatatypeProperty
label: 结束日期 @zh-cn
label: The date on which this monument description is no longer valid (destroyed, moved, etc...).
comment: 遗址描述不再有效（毁坏、迁移，等等）的日期。 @zh-cn
domain: Dead people place
domain: Container of human remains
domain: Human remains
domain: Monument
range: TemporalEntity
range: dateTime

Start Date
type: DatatypeProperty
label: 开始日期 @zh-cn
label: The date on which this monument description is valid (destroyed, moved, etc...).
comment: 遗址描述开始有效（毁坏、迁移，等等）的日期。 @zh-cn
domain: Dead people place
domain: Container of human remains
domain: Human remains
domain: Monument
range: TemporalEntity
range: dateTime

Location obfuscated (Deprecated)
type: DeprecatedProperty
term status: archaic
label: 混淆地点 @zh-cn
comment: The precision of the location informaton has been degraded but the data owner has the original information. (Deprecated, See #locationObfuscated)
domain: Location

Location
type: DeprecatedProperty
term status: archaic
label: Emplacement @fr
label: Lage @de
label: 地点 @zh-cn
comment: Location in terms of longitude, latitude or geonames or street address.
comment: Emplacement en terme de longitude, latitude ou attribut geonames ou addresse physique. @fr
comment: Lage in Bezug auf Länge, Breite oder Attribut geonames oder physikalische Adresse. @de
domain: Dead people place
domain: Grave
domain: Monument
range: wgs84 pos
range: ontology
range: string

Location
type: ObjectProperty
label: Emplacement @fr
label: Lage @de
label: 地点 @zh-cn
comment: Location in terms of longitude, latitude or geonames or street address.
comment: Emplacement en terme de longitude, latitude ou attribut geonames ou addresse physique. @fr
comment: Lage in Bezug auf Länge, Breite oder Attribut geonames oder physikalische Adresse. @de
comment: 用经度、纬度、地理名称或街道地址描述的地点。 @zh-cn
domain: Dead people place
domain: Grave
domain: Monument
range: wgs84 pos
range: ontology
range: string
equivalent property: Location

Obfuscated Location
type: ObjectProperty
name: Obfuscated Location
label: Emplacement obscurci @fr
label: Verdecktes Standort @de
label: 混淆地点 @zh-cn
comment: This property provides location information which is accurate but whos precision has been degraded for some reason. Replaces previous #obfuscated property.
comment: 这个属性提供了准确的地点信息，但是由于某些原因减低了精度。替换了之前的#obfuscated属性。 @zh-cn
sub property of: Location
equivalent property: Location obfuscated (Deprecated)

Denomination
type: ObjectProperty
name: Denomination
label: Dénomination @fr
label: Konfession @de
label: 教派 @zh-cn
comment: The religious denomination of the #Dead_people_place. For example, a Catholic cemetery."
comment: #Dead_people_place的宗教教派。比如天主教公墓。 @zh-cn
domain: Dead people place

Skeleton.
type: Class
label: Un squelette complet. @fr
label: Ein Skelett complet. @de
label: 骸骨 @zh-cn
comment: This property is meant to record that all of the larger bones of the skeleton were present. A body part seperatly buried or a skeleton missing a cranium would not be an instance of this property.
comment: Cette propriété rapporte le fait que la dépouille comprend tout les gros os du squelette humain, même si quelques petit os manque. Les os d'un membre du corps humain ou un squelette sans crane ne serait pas classes dans cette propriété. @fr
comment: Diese Eigenschaft bezieht sich auf die Tatsache, dass der Körper all der großen Knochen des menschlichen Skeletts enthält, obwohl einige kleine Knochen fehlt. Die Knochen eines Mitglieds des menschlichen Körpers, ohne ein Skelett oder Schädel-Klassen nicht in dieser Eigenschaft werden. @de
comment: 这个属性用于记录现场的骸骨的所有大型骨头。部分烧毁的躯体或者没有了头盖骨的骸骨都不能作为这个类的实例。 @zh-cn
sub class of: Human remains
disjoint with: Partial remains

Human Ashes
type: Class
label: Les cendres dispersées d'un corps humain. Les cendres peuvent être partielle or complète. @fr
label: Streute die Asche eines menschlichen Körpers. Die Asche kann teilweise oder vollständig. @de
label: 骨灰 @zh-cn
sub class: Human remains

Partial remains
type: Class
label: Morceau de squelette @fr
label: Teilweise bleibt @de
label: 部分遗骸 @zh-cn
comment: Indicates partial remains of an entity, some additional ontologies would be needed to extend this for part of remains information.
comment: 指明一个实体的部分遗骸，一些附加补充的本体需要为遗骸信息扩展这个类。 @zh-cn
sub class: Human remains

Grave
type: Class
label: Tombe @fr
label: Grab @de
label: 坟墓 @zh-cn
comment: A single or mass grave with the remains of human beings.
comment: Une tombe d'une ou de plusieurs personne. @fr
comment: Ein Grab aus einer oder mehreren Personen. @de
comment: 有人类尸体的一个单独坟墓或乱葬岗。 @zh-cn
equivalent class: Grave
sub class of: Container of human remains

Grave
wikipedia version: 515046345

War Grave
type: Class
label: Tombe Militare @fr
label: Grab @de
label: 战争坟墓 @zh-cn
comment: A grave of a soldier or person involved in a war. This can include non-combatants.
comment: 与一场战争有关的士兵或人员的坟墓。可以包括非战斗人员。 @zh-cn
sub class of: Grave
equivalent class: War grave

War grave
wikipedia version: 501583144

Epitaph
type: DatatypeProperty
label: Épitaphe @fr
label: 墓志铭 @zh-cn
comment: The short text honoring the deceased person or persons.
comment: Une inscription funéraire, placée sur une pierre tombale, qui éloge les personne(s) dans la tombe. @fr
comment: Eine Grabinschrift, auf einem Grabstein gesetzt, der diese in das Grab gelobt. @de
comment: 给死者以荣耀的短文。 @zh-cn
range: string
domain: Monument
sub property of: Inscription on Monument
equivalent property: Epitaph

Epitaph
wikipedia version: 514190813

Monument title
type: DatatypeProperty
label: Titre du Monument @fr
label: Titel des Denkmals @de
label: 纪念碑名称 @zh-cn
comment: The name of the monument; distinct from the inscription on it.
comment: Le nom du monument, à ne pas confondre avec le nom inscris sur le monument. @fr
comment: der Name des Denkmals, die nicht mit dem Namen auf dem Denkmal zu verwechseln beizutreten. @de
comment: 纪念碑的名称，不同于它上面的铭文。 @zh-cn
range: string
domain: Monument

Monument person name
type: DeprecatedProperty
term status: archaic
label: Nom de la personne @fr
label: Name der Person @de
label: 纪念碑名称 @zh-cn
comment: The name of the person(s) being honored by the monument.
comment: Le nom de la personne/des personnes qui est/sont honoré par le monument. @fr
comment: der Name der Person / Personen ist / sind durch die Denkmal geehrt. @de
range: string
domain: Monument

Inscription on Monument
type: ObjectProperty
name: Inscription
label: Inscription sur le Monument @fr
label: Anmeldung auf dem Denkmal @de
label: 铭文 @zh-cn
comment: The inscription on the monument. Can be a string or point to another document.
comment: 纪念碑上的铭文。可以是字符串，也可以指向另一个文档。 @zh-cn
domain: Monument
equivalent property: Monument person name

Mass Grave
type: Class
label: Fosse commune @fr
label: Massengrab @de
label: 乱葬岗 @zh-cn
comment: True if the grave contains more than the remains of one person. This limit is arbitrary and needs debate.
comment: Vrai si la tombe contient plus d'un corps. Cette limite est arbitraire et doit être discuté. @fr
comment: True, wenn das Grab enthält mehr als ein Körper. Diese Grenze ist willkürlich und sollte diskutiert werden. @de
comment: 如果墓中包括多于一个人的尸骸就是乱葬岗。这一限制是武断的, 需要进行辩论。 @zh-cn
equivalent class: Mass grave
sub class of: Dead people place
sub class of: Container of human remains
sub class of: Restriction
  on property: Grave contains remains
  min cardinality: 2

Mass grave
wikipedia version: 499197251

Ossuary
type: Class
label: Charnier @fr
label: Ossuaire @fr
label: Beinhaus @de
label: 藏尸骨的罐 @zh-cn
equivalent class: Ossuary
sub class of: Dead people place
sub class of: Container of human remains
sub class of: Restriction
  on property: Grave contains remains
  min cardinality: 2

Ossuary
wikipedia version: 495955021

Empty Grave
type: DeprecatedClass
term status: archaic
label: Tombe vide @fr
label: leere Grab @de
label: 空墓 @zh-cn
comment: Use this for empty graves.
sub class of: Container of human remains
sub class of: Restriction
  on property: Grave contains remains
  max cardinality: 0

Empty Grave
type: Class
label: Tombe vide @fr
label: leere Grab @de
label: 空墓 @zh-cn
comment: Use this for empty graves.
comment: 指空墓。 @zh-cn
sub class of: Container of human remains
sub class of: Restriction
  on property: Grave contains remains
  max cardinality: 0
equivalent class: Empty Grave

Grave contains remains
type: ObjectProperty
label: Contient les restes @fr
label: enthält die Überreste @de
label: 有尸体 @zh-cn
domain: Container of human remains
range: Human remains
equivalent property: Grave contains remains

Grave contains remains
type: DeprecatedProperty
term status: archaic
label: Contient les restes @fr
label: enthält die Überreste @de
label: 有尸体 @zh-cn
domain: Container of human remains
range: Human remains

Remains are in Grave
type: ObjectProperty
label: Les restes dans la tombe @fr
label: bleibt, sind in Grab @de
label: 尸体位于 @zh-cn
range: Container of human remains
domain: Human remains
inverse of: Grave contains remains
equivalent property: Remains are in Grave

Remains are in Grave
type: DeprecatedProperty
term status: archaic
label: Les restes dans la tombe @fr
label: bleibt, sind in Grab @de
label: 尸体位于 @zh-cn
range: Container of human remains
domain: Human remains
inverse of: Grave contains remains

contains grave
type: ObjectProperty
label: Contient tombeau @fr
label: Grab enthielt in @de
label: 有坟墓 @zh-cn
domain: Dead people place
range: Container of human remains
equivalent property: contains grave

contains grave
type: DeprecatedProperty
term status: archaic
label: Contient tombeau @fr
label: Grab enthielt in @de
label: 有坟墓 @zh-cn
domain: Dead people place
range: Container of human remains

Grave contained by
type: DeprecatedProperty
term status: archaic
label: Tombeau contenue par @fr
label: Tomb durch enthaltenen @de
label: 坟墓位于 @zh-cn
range: Dead people place
domain: Container of human remains
inverse of: contains grave

Grave contained by
type: ObjectProperty
label: Tombeau contenue par @fr
label: Tomb durch enthaltenen @de
label: 坟墓位于 @zh-cn
range: Dead people place
domain: Container of human remains
inverse of: contains grave
equivalent property: Grave contained by

Remains of this Person
type: DeprecatedProperty
term status: archaic
label: Les restes de cette personne @fr
label: Die Überreste dieser Person @de
label: 尸体属于 @zh-cn
comment: A place holder for any information related to the identity of the remains.
comment: Une reference a l'identité de la personne a qui la depouille appartient. @fr
comment: Ein Verweis auf die Identität der Person, die den Körper gehört. @de
domain: Human remains
range: Person
range: Agent

Remains of this Person
type: ObjectProperty
label: Les restes de cette personne @fr
label: Die Überreste dieser Person @de
label: 尸体属于 @zh-cn
comment: A place holder for any information related to the identity of the remains.
comment: Une reference a l'identité de la personne a qui la depouille appartient. @fr
comment: Ein Verweis auf die Identität der Person, die den Körper gehört. @de
comment: 有关识别某具尸体的任何信息的占位符。 @zh-cn
domain: Human remains
range: Person
range: Agent
equivalent property: Remains of this Person

Person has remains
type: DeprecatedProperty
term status: archaic
label: La personne a ces restes @fr
label: Person hat, bleibt @de
label: 尸体 @zh-cn
range: Human remains
domain: person
domain: Agent
inverse of: Remains of this Person

Person has remains
type: ObjectProperty
label: La personne a ces restes @fr
label: Person hat, bleibt @de
label: 尸体 @zh-cn
range: Human remains
domain: Person
domain: Agent
inverse of: Remains of this Person
equivalent property: Person has remains

Is a commemoration of
type: ObjectProperty
label: Est une commémoration de @fr
label: Gedenken @de
label: 纪念了 @zh-cn
comment: Records any information as to the Person, Group, Event being commemorated or represented.
comment: 记录了所纪念或描绘的人物、组织或事件的任何信息。 @zh-cn
domain: Monument
equivalent property: Commemorates

Has a commemoration
type: ObjectProperty
label: A une commémoration @fr
label: Ein Gedenken @de
label: 纪念物 @zh-cn
comment: Records a monument that commemorates or represents the Person, Group or Event.
comment: 记录了一个纪念或描绘了人物、组织或事件的纪念碑。Jerin记: 参考commemorated_by，把这个属性的domain换成了range。 @zh-cn
range: Monument
inverse of: Is a commemoration of
equivalent property: Commemorated by

Commemorates
type: DeprecatedProperty
term status: archaic
label: Commémore @fr
label: erinnert @de
label: 纪念物 @zh-cn
comment: Records any information as to the Person or Group being commemorated.
domain: Monument

Commemorated by
type: DeprecatedProperty
term status: archaic
label: Commémoré par @fr
label: erinnert @de
label: 被……纪念 @zh-cn
comment: Records any information as to the Person or Group being commemorated.
range: Monument
domain: Person
domain: Agent
domain: Container of human remains
inverse of: Commemorates